{"text_format":"1","workbook":"xlsx","n_sheets":5,"sheets":["Version history","COVER","INPUT and OUTPUT","Fuel Data - heating values","Unit conversion calculations"],"not_rendered":{"charts":0,"images":4,"macros":1,"external_links":1,"defined_names":15,"comments":2,"pivot_tables":0},"unopened":[],"bounds":{"document_bytes":16777216,"sheet_cells":100000,"rows_first":2000,"rows_last":500,"rows_between":2000,"halvings":0,"cell_chars":16384,"cell_head_chars":4096},"cells_cut":0,"cells_raw":0,"read":"whole","date_system":"1900"}

{"sheet":"Version history","index":0,"n_rows":2,"n_cols":4,"rows_kept":2,"cut":false,"hidden":false,"merged":[]}
[]
[null,"Date","Version","Comments"]

{"sheet":"COVER","index":1,"n_rows":61,"n_cols":19,"rows_kept":61,"cut":false,"hidden":false,"merged":[[8,2,10,22],[32,16,38,16],[37,8,37,12],[39,8,39,12],[59,3,59,20]]}
[]
[]
[]
[]
[]
[]
[]
[null,null,"INTRO"]
[null,null,"Le Centre régional de l'Énergie renouvelable et de l'efficacité énergétique de la CEDEAO (ECREEE), au nom des membres de la Communauté économique des États de l'Afrique de l'Ouest (CEDEAO), a demandé un soutien au service de dialogue par le partenariat de l'UE pour l'initiative énergétique (EUEI PDF) pour le développement d'un ensemble d'outils (boîte à outils) pour définir des tarifs pour les énergies renouvelables et fournir une assistance technique pour le calcul des tarifs des énergies renouvelables. En conséquence, EMRC (membre du MRC Group) a été mandaté par EUEI PDF pour développer une boîte à outils comprenant plusieurs modèles tarifaires standard pour calculer les tarifs des technologies renouvelables et un manuel d'utilisation associé.\nCe modèle basé sur Excel couvre la conversion d'unités pour les combustibles.\n"]
[]
[]
[]
[]
[null,null,"PANNEAU DE COMMANDE"]
[]
[]
[]
[]
[null,null,null,null,null,null,"Status:",{"$f":"WksProtected('INPUT and OUTPUT'!A1)","v":"Protégé"}]
[]
[]
[]
[]
[]
[]
[]
[null,null,"BOITE À OUTILS"]
[null,null,"Ceci est le modèle conversion d'unités des combustibles",null,null,null,null,"La boîte à outils est composée de 6 modèles Excel:"]
[]
[null,null,null,null,null,"Trois modèles de projects renouvelables",null,null,null,null,null,null,null,null,null,"Un modèle"]
[null,null,null,null,null,null,null,null,null,null,null,null,null,null,null,"d'objetifs de politique"]
[]
[null,null,null,null,null,null,null,null,"1. IPP Renouvelable",null,"2. Prossommateur",null,"3. Mini-réseau vert",null,null,null,"6. Modèle courbe d'offre"]
[]
[]
[]
[]
[null,null,null,null,null,"Deux modèles  pour",null,null,"4. Profil énergie éolienne"]
[null,null,null,null,null,"aider à la conversion"]
[null,null,null,null,null,"de données d'entrée",null,null,"5. Conversion unités combustible"]
{"$rows_left_out":22}
{"sheet":"INPUT and OUTPUT","index":2,"n_rows":21,"n_cols":10,"rows_kept":21,"cut":false,"hidden":false,"merged":[[8,9,9,10],[14,3,15,3],[14,1,15,1],[19,1,20,1],[19,3,20,3],[11,3,12,3],[11,1,12,1],[8,3,9,3],[8,1,9,1]]}
[null,"Convertisseur d'unités de combustible"]
[]
[null,"Données d'entrée"]
[]
[null,"Type de combustible",null,"Residual oil (HFO)",null,"Du tableau dans la fiche technique de carburant de soutien (fuel data - heating values)"]
[null,"Valeur Calorifique: Standard or User Defined?",null,"Standard"]
[null,"Valeur Calorifique Inférieure (LHV) ou Supérieure (HHV)?",null,"HHV"]
[]
[null,"Entrée manuel (user defined) pour LHV ou HHV",null,null,null,"MJ","(Monnaie)",null,null,"* Veuillez noter que les prix et les valeurs de chauffage des combustibles solides ne doivent être exprimés que par unité de masse"]
[null,null,null,null,null,"kg","(Unités de volume ou masse)"]
[]
[null,"Valeur calorifique sélectionnée",null,{"$f":"+IF(D6=\"User Defined\",$D$9,INDEX('Fuel Data - heating values'!$F$5:$L$85,MATCH($D$5,'Fuel Data - heating values'!$F$5:$F$85,0),MATCH('INPUT and OUTPUT'!$D$7,'Fuel Data - heating values'!$F$5:$L$5,0)))","v":11.630662274014229},null,{"$f":"+IF(D6=\"User Defined\",$F$9,INDEX('Fuel Data - heating values'!$A$5:$L$85,MATCH($D$5,'Fuel Data - heating values'!$A$5:$A$85,0),MATCH('INPUT and OUTPUT'!$D$7&\" numerator unit\",'Fuel Data - heating values'!$A$5:$L$5,0)))","v":"MWh"},"(Monnaie)"]
[null,null,null,null,null,{"$f":"+IF(D6=\"User Defined\",$F$10,INDEX('Fuel Data - heating values'!$A$5:$L$85,MATCH($D$5,'Fuel Data - heating values'!$A$5:$A$85,0),MATCH('INPUT and OUTPUT'!$D$7&\" denominator unit\",'Fuel Data - heating values'!$A$5:$L$5,0)))","v":"m3"},"(Unités de volume ou masse)"]
[]
[null,"Prix du combustible d'entrée",null,null,null,"USD","(Monnaie)"]
[null,null,null,null,null,"Metric Tonne","(Unités d'énergie, volume ou masse)"]
[]
[null,"Sorties"]
[]
[null,"Prix du combustible de sortie",null,{"$f":"+IFERROR($D$15*INDEX('Unit conversion calculations'!$B$62:$Q$77,MATCH($F$21,'Unit conversion calculations'!$B$62:$B$77,0),MATCH('INPUT and OUTPUT'!$F$16,'Unit conversion calculations'!$B$62:$Q$62,0)),\"Error please review Inputs\")","v":0},null,{"$f":"+F15","v":"USD"},"(Monnaie)"]
[null,null,null,null,null,"MWh","(Unités d'énergie, volume ou masse)"]

{"sheet":"Fuel Data - heating values","index":3,"n_rows":85,"n_cols":13,"rows_kept":85,"cut":false,"hidden":false,"merged":[]}
["Specifications of Fuels"]
["SOURCE: GREET Transportation Fuel Cycle Analysis Model, GREET 1.8b, developed by Argonne National Laboratory. https://greet.es.anl.gov/"]
[]
["Fuel","Density","LHV","HHV"]
[null,null,null,null,null,null,"LHV","LHV numerator unit","LHV denominator unit","HHV","HHV numerator unit","HHV denominator unit","Density"]
["Liquid Fuels:","grams/gal","Btu/gal","Btu/gal",null,null,"MWh/m3",null,null,"MWh/m3",null,null,"g/m3"]
["Acetone",2964,83127,89511,null,{"$f":"A7","v":"Acetone"},{"$f":"+C7*'Unit conversion calculations'!$D$6*'Unit conversion calculations'!$E$12","v":6.440757197068689},"MWh","m3",{"$f":"+D7*'Unit conversion calculations'!$D$6*'Unit conversion calculations'!$E$12","v":6.935395448732848},"MWh","m3",{"$f":"+B7*'Unit conversion calculations'!$E$12","v":783005.9631895565}]
["Bitumen",3839.6821254480283,152370.90134048002,162963.53084543315,null,"Bitumen",{"$f":"+C8*'Unit conversion calculations'!$D$6*'Unit conversion calculations'!$E$12","v":11.805839010580675},"MWh","m3",{"$f":"+D8*'Unit conversion calculations'!$D$6*'Unit conversion calculations'!$E$12","v":12.626565786717299},"MWh","m3",{"$f":"+B8*'Unit conversion calculations'!$E$12","v":1014336.7074825091}]
["Bunker fuel for ocean tanker (HFO)",3752,140352.52220119376,150110,null,"Bunker fuel for ocean tanker (HFO)",{"$f":"+C9*'Unit conversion calculations'!$D$6*'Unit conversion calculations'!$E$12","v":10.874643828047224},"MWh","m3",{"$f":"+D9*'Unit conversion calculations'!$D$6*'Unit conversion calculations'!$E$12","v":11.630662274014229},"MWh","m3",{"$f":"+B9*'Unit conversion calculations'!$E$12","v":991173.54044777877}]
["Butane",2213,94970,103220,null,"Butane",{"$f":"+C10*'Unit conversion calculations'!$D$6*'Unit conversion calculations'!$E$12","v":7.358363840937522},"MWh","m3",{"$f":"+D10*'Unit conversion calculations'!$D$6*'Unit conversion calculations'!$E$12","v":7.9975815063869744},"MWh","m3",{"$f":"+B10*'Unit conversion calculations'!$E$12","v":584612.75186858594}]
["Butanol",3065,99837,108458,null,"Butanol",{"$f":"+C11*'Unit conversion calculations'!$D$6*'Unit conversion calculations'!$E$12","v":7.7354635230881259},"MWh","m3",{"$f":"+D11*'Unit conversion calculations'!$D$6*'Unit conversion calculations'!$E$12","v":8.4034266132505184},"MWh","m3",{"$f":"+B11*'Unit conversion calculations'!$E$12","v":809687.34047772968}]
["CA gasoline",2835.5620000000004,112193.52,120438.62000000001,null,"CA gasoline",{"$f":"+C12*'Unit conversion calculations'!$D$6*'Unit conversion calculations'!$E$12","v":8.6928581736917003},"MWh","m3",{"$f":"+D12*'Unit conversion calculations'!$D$6*'Unit conversion calculations'!$E$12","v":9.3316961825883418},"MWh","m3",{"$f":"+B12*'Unit conversion calculations'!$E$12","v":749076.23312878062}]
["Conventional Jet Fuel",3035.8996219999995,124307.03423937227,132948.69438683367,null,"Conventional Jet Fuel",{"$f":"+C13*'Unit conversion calculations'!$D$6*'Unit conversion calculations'!$E$12","v":9.6314245121741529},"MWh","m3",{"$f":"+D13*'Unit conversion calculations'!$D$6*'Unit conversion calculations'!$E$12","v":10.300988369758135},"MWh","m3",{"$f":"+B13*'Unit conversion calculations'!$E$12","v":801999.83389707154}]
["Crude oil",3205,129670,138350,null,"Crude oil",{"$f":"+C14*'Unit conversion calculations'!$D$6*'Unit conversion calculations'!$E$12","v":10.046952082282495},"MWh","m3",{"$f":"+D14*'Unit conversion calculations'!$D$6*'Unit conversion calculations'!$E$12","v":10.719486547264465},"MWh","m3",{"$f":"+B14*'Unit conversion calculations'!$E$12","v":846671.42780787067}]
["Diesel for non-road engines",3167,128450,137380,null,"Diesel for non-road engines",{"$f":"+C15*'Unit conversion calculations'!$D$6*'Unit conversion calculations'!$E$12","v":9.9524253487251215},"MWh","m3",{"$f":"+D15*'Unit conversion calculations'!$D$6*'Unit conversion calculations'!$E$12","v":10.644330045993438},"MWh","m3",{"$f":"+B15*'Unit conversion calculations'!$E$12","v":836632.88981826103}]
["Dilbit (After Recovery)",3839.6821254480283,152370.90134048002,162963.53084543315,null,"Dilbit (After Recovery)",{"$f":"+C16*'Unit conversion calculations'!$D$6*'Unit conversion calculations'!$E$12","v":11.805839010580675},"MWh","m3",{"$f":"+D16*'Unit conversion calculations'!$D$6*'Unit conversion calculations'!$E$12","v":12.626565786717299},"MWh","m3",{"$f":"+B16*'Unit conversion calculations'!$E$12","v":1014336.7074825091}]
["Dilbit (Before Recovery)",3500.47748781362,145194.18901496602,155287.90268980322,null,"Dilbit (Before Recovery)",{"$f":"+C17*'Unit conversion calculations'!$D$6*'Unit conversion calculations'!$E$12","v":11.249780671390692},"MWh","m3",{"$f":"+D17*'Unit conversion calculations'!$D$6*'Unit conversion calculations'!$E$12","v":12.031850985444589},"MWh","m3",{"$f":"+B17*'Unit conversion calculations'!$E$12","v":924728.32218922488}]
["Diluent",2709,128448.52692210001,137378.10365999999,null,"Diluent",{"$f":"+C18*'Unit conversion calculations'!$D$6*'Unit conversion calculations'!$E$12","v":9.9523112132807245},"MWh","m3",{"$f":"+D18*'Unit conversion calculations'!$D$6*'Unit conversion calculations'!$E$12","v":10.644183115808261},"MWh","m3",{"$f":"+B18*'Unit conversion calculations'!$E$12","v":715642.0898382283}]
["Dimethoxy methane (DMM)",3255,72200,79196.89540113158,null,"Dimethoxy methane (DMM)",{"$f":"+C19*'Unit conversion calculations'!$D$6*'Unit conversion calculations'!$E$12","v":5.5941230842970322},"MWh","m3",{"$f":"+D19*'Unit conversion calculations'!$D$6*'Unit conversion calculations'!$E$12","v":6.1362490411098003},"MWh","m3",{"$f":"+B19*'Unit conversion calculations'!$E$12","v":859880.03042577824}]
["Dimethyl ether (DME)",2518,68930,75610,null,"Dimethyl ether (DME)",{"$f":"+C20*'Unit conversion calculations'!$D$6*'Unit conversion calculations'!$E$12","v":5.340760445991612},"MWh","m3",{"$f":"+D20*'Unit conversion calculations'!$D$6*'Unit conversion calculations'!$E$12","v":5.8583330526828048},"MWh","m3",{"$f":"+B20*'Unit conversion calculations'!$E$12","v":665185.2278378217}]
["E-Diesel Additives",2819,116090,124340,null,"E-Diesel Additives",{"$f":"+C21*'Unit conversion calculations'!$D$6*'Unit conversion calculations'!$E$12","v":8.994761064488122},"MWh","m3",{"$f":"+D21*'Unit conversion calculations'!$D$6*'Unit conversion calculations'!$E$12","v":9.6339787299375743},"MWh","m3",{"$f":"+B21*'Unit conversion calculations'!$E$12","v":744701.01559762482}]
["Ethanol",2988,76330,84530,null,"Ethanol",{"$f":"+C22*'Unit conversion calculations'!$D$6*'Unit conversion calculations'!$E$12","v":5.9141193216674859},"MWh","m3",{"$f":"+D22*'Unit conversion calculations'!$D$6*'Unit conversion calculations'!$E$12","v":6.5494629406596685},"MWh","m3",{"$f":"+B22*'Unit conversion calculations'!$E$12","v":789346.09244615212}]
["Ethyl tertiary butyl ether (ETBE)",2810,96720,104530,null,"Ethyl tertiary butyl ether (ETBE)",{"$f":"+C23*'Unit conversion calculations'!$D$6*'Unit conversion calculations'!$E$12","v":7.4939554669419515},"MWh","m3",{"$f":"+D23*'Unit conversion calculations'!$D$6*'Unit conversion calculations'!$E$12","v":8.0990815235674329},"MWh","m3",{"$f":"+B23*'Unit conversion calculations'!$E$12","v":742323.46712640149}]
["Fischer-Tropsch diesel (FTD)",3017,123670,130030,null,"Fischer-Tropsch diesel (FTD)",{"$f":"+C24*'Unit conversion calculations'!$D$6*'Unit conversion calculations'!$E$12","v":9.5820665074101647},"MWh","m3",{"$f":"+D24*'Unit conversion calculations'!$D$6*'Unit conversion calculations'!$E$12","v":10.074845216774834},"MWh","m3",{"$f":"+B24*'Unit conversion calculations'!$E$12","v":797007.08196453855}]
["Gasoline",2835.5620000000004,112193.52,120438.62000000001,null,"Gasoline",{"$f":"+C25*'Unit conversion calculations'!$D$6*'Unit conversion calculations'!$E$12","v":8.6928581736917003},"MWh","m3",{"$f":"+D25*'Unit conversion calculations'!$D$6*'Unit conversion calculations'!$E$12","v":9.3316961825883418},"MWh","m3",{"$f":"+B25*'Unit conversion calculations'!$E$12","v":749076.23312878062}]
["Gasoline blendstock",2819,116090,124340,null,"Gasoline blendstock",{"$f":"+C26*'Unit conversion calculations'!$D$6*'Unit conversion calculations'!$E$12","v":8.994761064488122},"MWh","m3",{"$f":"+D26*'Unit conversion calculations'!$D$6*'Unit conversion calculations'!$E$12","v":9.6339787299375743},"MWh","m3",{"$f":"+B26*'Unit conversion calculations'!$E$12","v":744701.01559762482}]
["High Octane Fuel (E25)",2861.25,106150,114387.5,null,"High Octane Fuel (E25)",{"$f":"+C27*'Unit conversion calculations'!$D$6*'Unit conversion calculations'!$E$12","v":8.2246006287829623},"MWh","m3",{"$f":"+D27*'Unit conversion calculations'!$D$6*'Unit conversion calculations'!$E$12","v":8.8628497826180972},"MWh","m3",{"$f":"+B27*'Unit conversion calculations'!$E$12","v":755862.28480975667}]
["High Octane Fuel (E40)",2886.6,100186,108416,null,"High Octane Fuel (E40)",{"$f":"+C28*'Unit conversion calculations'!$D$6*'Unit conversion calculations'!$E$12","v":7.7625043673598668},"MWh","m3",{"$f":"+D28*'Unit conversion calculations'!$D$6*'Unit conversion calculations'!$E$12","v":8.4001724142264127},"MWh","m3",{"$f":"+B28*'Unit conversion calculations'!$E$12","v":762559.04633703572}]
["Isobutane",2118,90060,98560,null,"Isobutane",{"$f":"+C29*'Unit conversion calculations'!$D$6*'Unit conversion calculations'!$E$12","v":6.9779324788336661},"MWh","m3",{"$f":"+D29*'Unit conversion calculations'!$D$6*'Unit conversion calculations'!$E$12","v":7.6365203765694654},"MWh","m3",{"$f":"+B29*'Unit conversion calculations'!$E$12","v":559516.40689456172}]
["Isobutylene",2253,95720,103010,null,"Isobutylene",{"$f":"+C30*'Unit conversion calculations'!$D$6*'Unit conversion calculations'!$E$12","v":7.4164745377965628},"MWh","m3",{"$f":"+D30*'Unit conversion calculations'!$D$6*'Unit conversion calculations'!$E$12","v":7.9813105112664431},"MWh","m3",{"$f":"+B30*'Unit conversion calculations'!$E$12","v":595179.6339629119}]
["Liquefied natural gas (LNG)",1621,74720,84820,null,"Liquefied natural gas (LNG)",{"$f":"+C31*'Unit conversion calculations'!$D$6*'Unit conversion calculations'!$E$12","v":5.7893750257434107},"MWh","m3",{"$f":"+D31*'Unit conversion calculations'!$D$6*'Unit conversion calculations'!$E$12","v":6.571932410111831},"MWh","m3",{"$f":"+B31*'Unit conversion calculations'!$E$12","v":428222.89687256113}]
["Liquefied petroleum gas (LPG)",1923,84950,91410,null,"Liquefied petroleum gas (LPG)",{"$f":"+C32*'Unit conversion calculations'!$D$6*'Unit conversion calculations'!$E$12","v":6.582004930900732},"MWh","m3",{"$f":"+D32*'Unit conversion calculations'!$D$6*'Unit conversion calculations'!$E$12","v":7.0825317331799393},"MWh","m3",{"$f":"+B32*'Unit conversion calculations'!$E$12","v":508002.85668472241}]
["Liquid hydrogen",268,30500,36020,null,"Liquid hydrogen",{"$f":"+C33*'Unit conversion calculations'!$D$6*'Unit conversion calculations'!$E$12","v":2.3631683389343414},"MWh","m3",{"$f":"+D33*'Unit conversion calculations'!$D$6*'Unit conversion calculations'!$E$12","v":2.7908630678168849},"MWh","m3",{"$f":"+B33*'Unit conversion calculations'!$E$12","v":70798.110031984193}]
["Low-sulfur diesel",3206,129487.84757606639,138490,null,"Low-sulfur diesel",{"$f":"+C34*'Unit conversion calculations'!$D$6*'Unit conversion calculations'!$E$12","v":10.032838743230034},"MWh","m3",{"$f":"+D34*'Unit conversion calculations'!$D$6*'Unit conversion calculations'!$E$12","v":10.730333877344819},"MWh","m3",{"$f":"+B34*'Unit conversion calculations'!$E$12","v":846935.59986022883}]
["Methanol",3006,57250,65200,null,"Methanol",{"$f":"+C35*'Unit conversion calculations'!$D$6*'Unit conversion calculations'!$E$12","v":4.4357831935734771},"MWh","m3",{"$f":"+D35*'Unit conversion calculations'!$D$6*'Unit conversion calculations'!$E$12","v":5.0517565802793136},"MWh","m3",{"$f":"+B35*'Unit conversion calculations'!$E$12","v":794101.1893885989}]
["Methyl ester (biodiesel, BD)",3361,119550,127960,null,"Methyl ester (biodiesel, BD)",{"$f":"+C36*'Unit conversion calculations'!$D$6*'Unit conversion calculations'!$E$12","v":9.2628450793311661},"MWh","m3",{"$f":"+D36*'Unit conversion calculations'!$D$6*'Unit conversion calculations'!$E$12","v":9.9144596934438809},"MWh","m3",{"$f":"+B36*'Unit conversion calculations'!$E$12","v":887882.26797574211}]
["Methyl tertiary butyl ether (MTBE)",2811,93540,101130,null,"Methyl tertiary butyl ether (MTBE)",{"$f":"+C37*'Unit conversion calculations'!$D$6*'Unit conversion calculations'!$E$12","v":7.2475661122596167},"MWh","m3",{"$f":"+D37*'Unit conversion calculations'!$D$6*'Unit conversion calculations'!$E$12","v":7.8356463644731136},"MWh","m3",{"$f":"+B37*'Unit conversion calculations'!$E$12","v":742587.63917875965}]
["Natural gas liquids",2532,83686.11202275462,90050,null,"Natural gas liquids",{"$f":"+C38*'Unit conversion calculations'!$D$6*'Unit conversion calculations'!$E$12","v":6.4840777160880743},"MWh","m3",{"$f":"+D38*'Unit conversion calculations'!$D$6*'Unit conversion calculations'!$E$12","v":6.9771576695422119},"MWh","m3",{"$f":"+B38*'Unit conversion calculations'!$E$12","v":668883.63657083572}]
["NG-based FT naphtha",2651,111520,119740,null,{"$f":"A39","v":"NG-based FT naphtha"},{"$f":"+C39*'Unit conversion calculations'!$D$6*'Unit conversion calculations'!$E$12","v":8.6406732182936974},"MWh","m3",{"$f":"+D39*'Unit conversion calculations'!$D$6*'Unit conversion calculations'!$E$12","v":9.2775664558687883},"MWh","m3",{"$f":"+B39*'Unit conversion calculations'!$E$12","v":700320.11080145556}]
["n-Hexane",2478.6999999999998,105124.8,112166.3,null,"n-Hexane",{"$f":"+C40*'Unit conversion calculations'!$D$6*'Unit conversion calculations'!$E$12","v":8.14516718022311},"MWh","m3",{"$f":"+D40*'Unit conversion calculations'!$D$6*'Unit conversion calculations'!$E$12","v":8.690749142800362},"MWh","m3",{"$f":"+B40*'Unit conversion calculations'!$E$12","v":654803.26618014637}]
{"$rows_left_out":46}
{"sheet":"Unit conversion calculations","index":4,"n_rows":77,"n_cols":17,"rows_kept":77,"cut":false,"hidden":false,"merged":[]}
["UNIT CONVERSION DATA"]
[null,null,"Equals:"]
["ENERGY",null,"kWh","MWh","Btu","MMBtu","MJ","kCal"]
["1 unit of:","kWh",1,1E-3,3409.5106405145002,3.4095106405145001E-3,3.6,859.84522785899003]
[null,"MWh",1000,1,3409510.6405145,3.4095106405145001,3600,859845.22785899008]
[null,"Btu",2.9329722222221999E-4,2.9329722222221999E-7,1,9.9999999999999995E-7,1.0558700000000041E-3,0.25219021687206999]
[null,"MMBtu",293.29722222222,0.29329722222221999,1000000,1,1055.8700000000042,252190.21687206998]
[null,"MJ",0.27777777777777779,2.7777777777777778E-4,947.08628903178999,9.4708628903178991E-4,1,238.8458966275]
[null,"kCal",1.1629999999999937E-3,1.1629999999999936E-6,3.9652608749183789,3.9652608749183795E-6,4.1867999999999289E-3,1]
["VOLUME",null,"Equals:"]
[null,null,"m3","Litre","US Gallon","Imperial Gallon","ft3","bbl (oil)"]
["1 unit of:","m3",1,1000,264.17205235814998,219.96924829909,35.314666721488997,{"$f":"TRANSPOSE(1/C17:G17)","v":6.2898105697750699}]
[null,"Litre",1E-3,1,0.26417205235815,0.21996924829909001,3.5314666721489002E-2,6.2898105697750699E-3]
[null,"US Gallon",3.7854117839999776E-3,3.7854117839999772,1,0.83267418462899001,0.13368055555555999,2.3809523049954165E-2]
[null,"Imperial Gallon",4.5460899999999541E-3,4.5460899999999542,1.2009499255048532,1,0.16054365323589001,2.859404493314846E-2]
[null,"ft3",2.8316846591999675E-2,28.316846591999671,7.4805194805192325,6.2288354590429051,1,0.17810760099705872]
[null,"bbl (oil)",0.1589873,{"$f":"+$C$17*D12","v":158.9873},{"$f":"+$C$17*E12","v":42.000001339880896},34.972316870101913,5.6145835124493875,1]
[null,null,"Equals:"]
["MASS",null,"gram","kg","Metric Tonne"]
["1 unit of:","gram",1,1E-3,9.9999999999999995E-7]
[null,"kg",1000,1,1E-3]
[null,"Metric Tonne",1000000,1000,1]
[]
["Merged:",null,"kWh","MWh","Btu","MMBtu","MJ","kCal","m3","Litre","US Gallon","Imperial Gallon","ft3","bbl (oil)","gram","kg","Metric Tonne"]
[null,"kWh",{"$f":"+C4","v":1},{"$f":"+D4","v":1E-3},{"$f":"+E4","v":3409.5106405145002},3.4095106405145001E-3,3.6,859.84522785899003]
[null,"MWh",1000,{"$f":"+D5","v":1},3409510.6405145,3.4095106405145001,3600,859845.22785899008]
[null,"Btu",2.9329722222221999E-4,{"$f":"+D6","v":2.9329722222221999E-7},1,9.9999999999999995E-7,1.0558700000000041E-3,0.25219021687206999]
[null,"MMBtu",293.29722222222,{"$f":"+D7","v":0.29329722222221999},1000000,1,1055.8700000000042,252190.21687206998]
[null,"MJ",0.27777777777777779,{"$f":"+D8","v":2.7777777777777778E-4},947.08628903178999,9.4708628903178991E-4,1,238.8458966275]
[null,"kCal",1.1629999999999937E-3,{"$f":"+D9","v":1.1629999999999936E-6},3.9652608749183789,3.9652608749183795E-6,4.1867999999999289E-3,1]
[null,"m3",null,null,null,null,null,null,{"$f":"+C12","v":1},{"$f":"+D12","v":1000},264.17205235814998,219.96924829909,35.314666721488997,6.2898105697750699]
[null,"Litre",null,null,null,null,null,null,1E-3,1,{"$f":"+E13","v":0.26417205235815},0.21996924829909001,3.5314666721489002E-2,6.2898105697750699E-3]
[null,"US Gallon",null,null,null,null,null,null,3.7854117839999776E-3,3.7854117839999772,1,0.83267418462899001,0.13368055555555999,2.3809523049954165E-2]
[null,"Imperial Gallon",null,null,null,null,null,null,{"$f":"+C15","v":4.5460899999999541E-3},4.5460899999999542,1.2009499255048532,1,0.16054365323589001,2.859404493314846E-2]
[null,"ft3",null,null,null,null,null,null,2.8316846591999675E-2,28.316846591999671,7.4805194805192325,6.2288354590429051,1,0.17810760099705872]
[null,"bbl (oil)",null,null,null,null,null,null,0.1589873,158.9873,42.000001339880896,34.972316870101913,5.6145835124493875,1]
[null,"gram",null,null,null,null,null,null,null,null,null,null,null,null,{"$f":"+C20","v":1},1E-3,9.9999999999999995E-7]
[null,"kg",null,null,null,null,null,null,null,null,null,null,null,null,1000,1,1E-3]
[null,"Metric Tonne",null,null,null,null,null,null,null,null,null,null,null,null,1000000,1000,1]
[]
{"$rows_left_out":37}